{"text_format":"1","workbook":"xlsx","n_sheets":7,"sheets":["random simulaties","scoring vragenlijst","simulation","analyse du client","analyse klant obv rand. simul.","analyse klant obv rand. sim (2","invoerresultaten"],"not_rendered":{"charts":15,"images":1,"macros":1,"external_links":0,"defined_names":3,"comments":0,"pivot_tables":0},"unopened":[],"bounds":{"document_bytes":16777216,"sheet_cells":100000,"rows_first":2000,"rows_last":500,"rows_between":2000,"halvings":0,"cell_chars":16384,"cell_head_chars":4096},"cells_cut":0,"cells_raw":0,"read":"whole","date_system":"1900"}

{"sheet":"random simulaties","index":0,"n_rows":78,"n_cols":19,"rows_kept":78,"cut":false,"hidden":true,"merged":[[19,0,41,0],[13,2,16,2],[9,2,12,2],[1,0,18,0],[9,1,18,1],[1,8,2,8],[3,8,4,8],[5,4,8,4],[5,5,8,5],[66,1,68,1],[65,8,68,8],[53,3,53,4],[62,1,64,1],[27,5,30,5],[1,1,2,1],[9,7,16,7],[9,8,16,8],[31,1,34,1],[1,7,2,7],[3,7,4,7],[47,8,50,8],[77,3,77,4],[77,5,77,6],[24,5,26,5],[24,4,26,4],[35,1,38,1],[39,1,41,1],[39,4,41,4],[39,5,41,5],[47,4,50,4],[47,5,50,5],[35,4,38,4],[35,5,38,5],[57,7,60,7],[61,7,64,7],[65,7,68,7],[69,7,72,7],[57,8,60,8],[61,8,64,8],[69,8,72,8],[47,7,50,7],[24,7,26,7],[24,8,26,8],[75,3,75,4],[5,7,8,7],[19,7,23,7],[27,7,30,7],[35,7,38,7],[39,7,41,7],[42,7,46,7],[56,2,56,3],[5,8,8,8],[19,8,23,8],[27,8,30,8],[35,8,38,8],[39,8,41,8],[42,8,46,8],[57,0,72,0],[57,4,60,4],[57,5,60,5],[61,4,64,4],[61,5,64,5],[65,4,68,4],[65,5,68,5],[69,4,72,4],[69,5,72,5],[58,1,60,1],[70,1,72,1],[42,0,50,0],[42,1,46,1],[42,4,46,4],[42,5,46,5],[0,2,0,3],[19,1,22,1],[19,4,22,4],[19,5,22,5],[27,1,30,1],[3,1,4,1],[1,4,2,4],[27,4,30,4],[24,1,26,1],[3,5,4,5],[1,5,2,5],[9,4,16,4],[9,5,16,5],[3,4,4,4]]}
[null,"vragen","antwoordmogelijkheden",null,"algemene weging","scoring/vraag","scoring/ antwoord","random test","Gesimuleerd antwoord","gewicht indiv antwoord tov totale score (meest doorslaggevende indiv antwoord aangegeven in rood)",null,"soort vraag","gewicht","Check-up klant","resultaat klant",0.5,"maximum score","antwoord klant "]
["A. Kennis en ervaring","1 kennis uit opleiding","a","nee","minst doorslag-gevend",{"$f":"VLOOKUP(E2,$L$2:$M$6,2)","v":35},{"$f":"'scoring vragenlijst'!G2","v":0},{"$f":" RANDBETWEEN(1,2)","v":1},{"$f":"IF(H2=1,G2,IF(H2=2,G3,G5))","v":0},{"$f":"G2/$F$52","v":0},null,"het meest doorslaggevend",{"$f":"'scoring vragenlijst'!N2","v":150},"Kennis en ervaring",{"$f":"R2/$Q$2","v":0.61764705882352944},null,{"$f":"SUM(Q3:Q5)","v":170},{"$f":"SUM(R3:R5)","v":105}]
[null,null,"b","ja",null,null,{"$f":"'scoring vragenlijst'!G3","v":35},null,null,3.5000000000000003E-2,null,"meer doorslaggevend",{"$f":"'scoring vragenlijst'!N3","v":125},"1 kennis uit opleiding",{"$f":"R3/$Q$2","v":0},0.5,{"$f":"F2","v":35},{"$f":"I2","v":0}]
[null,"2 beroeps-matige kennis","a","nee","minst doorslag-gevend",{"$f":"VLOOKUP(E4,$L$2:$M$6,2)","v":35},{"$f":"'scoring vragenlijst'!G4","v":0},{"$f":" RANDBETWEEN(1,2)","v":2},{"$f":"IF(H4=1,G4,IF(H4=2,G5,G7))","v":35},0,null,"midden",{"$f":"'scoring vragenlijst'!N4","v":100},"2 beroepskennis",{"$f":"R4/$Q$2","v":0.20588235294117646},0.5,{"$f":"F4","v":35},{"$f":"I4","v":35}]
[null,null,"b","ja",null,null,{"$f":"'scoring vragenlijst'!G5","v":35},null,null,3.5000000000000003E-2,null,"minder",{"$f":"'scoring vragenlijst'!N5","v":60},"3 interesse",{"$f":"R5/$Q$2","v":0.41176470588235292},0.5,{"$f":"F6","v":100},{"$f":"I6","v":70}]
[null,"2 interesse","a","geen interesse","midden",{"$f":"VLOOKUP(E6,$L$2:$M$6,2)","v":100},{"$f":"'scoring vragenlijst'!G6","v":0},{"$f":"RANDBETWEEN(1,4)","v":3},{"$f":"IF(H6=1,G6,IF(H6=2,G7,IF(H6=3,G8,G9)))","v":70},0,null,"minst doorslaggevend",{"$f":"'scoring vragenlijst'!N6","v":35},null,{"$f":"100%-SUM(O3:O5)","v":0.38235294117647056}]
[null,null,"b","lees financiële bladzijden",null,null,{"$f":"'scoring vragenlijst'!G7","v":30},null,null,0.03,null,null,null,"Financiële situatie",{"$f":"R7/$Q$7","v":0.25},null,{"$f":"SUM(Q8:Q11)","v":420},{"$f":"SUM(R8:R11)","v":105}]
[null,null,"c","zoek actief financiële informatie",null,null,{"$f":"'scoring vragenlijst'!G8","v":70},null,null,7.0000000000000007E-2,null,"totaal",{"$f":"F52","v":1000},"4 roerend vermogen",{"$f":"R8/$Q$7","v":0},0.5,{"$f":"F20","v":150},{"$f":"I20","v":0}]
[null,null,"d","volg financiële markt beroepsmatig",null,null,{"$f":"'scoring vragenlijst'!G9","v":100},null,null,0.1,null,null,null,"5 onroerend vermogen",{"$f":"R9/$Q$7","v":0.14285714285714285},0.5,{"$f":"F25","v":60},{"$f":"I25","v":60}]
[null,"3 tabel producten","producten die u kent","T21","minder",{"$f":"VLOOKUP(E10,$L$2:$M$6,2)","v":60},{"$f":"'scoring vragenlijst'!G10","v":6},{"$f":"RANDBETWEEN(1,60)","v":49},{"$f":"EVEN(H10)","v":50},6.0000000000000001E-3,null,null,null,"6a netto-inkomen",{"$f":"R10/$Q$7","v":0},0.5,{"$f":"F28","v":60},{"$f":"I28","v":0}]
[null,null,null,"T23 zonder kapitaalsbescherming",null,null,{"$f":"'scoring vragenlijst'!G11","v":8},null,null,8.0000000000000002E-3,null,null,null,"7 spaarmogelijkheid",{"$f":"R11/$Q$7","v":0.10714285714285714},0.5,{"$f":"F36","v":150},{"$f":"I36","v":45}]
[null,null,null,"T23 met kapitaalsbescherming",null,null,{"$f":"'scoring vragenlijst'!G12","v":10},null,null,0.01,null,null,null,null,{"$f":"100%-(SUM(O8:O11))","v":0.75}]
[null,null,null,"T26",null,null,{"$f":"'scoring vragenlijst'!G17","v":6},null,null,6.0000000000000001E-3,null,null,null,"Risico-appetijt",{"$f":"R13/$Q$13","v":0.5},null,{"$f":"SUM(Q14:Q17)","v":1000},{"$f":"SUM(R14:R17)","v":500}]
[null,null,"producten waarin u belegt of heeft belegd (zowel occasioneel als regelmatig)","T21",null,null,{"$f":"'scoring vragenlijst'!G18","v":6},null,null,6.0000000000000001E-3,null,null,null,"11 belegginsgsvoorkeur",{"$f":"R14/$Q$13","v":0},0.5,{"$f":"F58","v":250},{"$f":"I58","v":0}]
[null,null,null,"T23 zonder kapitaalsbescherming",null,null,{"$f":"'scoring vragenlijst'!G19","v":8},null,null,8.0000000000000002E-3,null,null,null,"12 reactie bij sterke daling beleggingen",{"$f":"R15/$Q$13","v":0.16500000000000001},0.5,{"$f":"F62","v":250},{"$f":"I62","v":165}]
[null,null,null,"T23 met kapitaalsbescherming",null,null,{"$f":"'scoring vragenlijst'!G20","v":10},null,null,0.01,null,null,null,"13 welke schommeling waarde",{"$f":"R16/$Q$13","v":8.5000000000000006E-2},0.5,{"$f":"F66","v":250},{"$f":"I66","v":85}]
[null,null,null,"T26",null,null,{"$f":"'scoring vragenlijst'!G25","v":6},null,null,6.0000000000000001E-3,null,null,null,"14 verlies opvangbaar",{"$f":"R17/$Q$13","v":0.25},0.5,{"$f":"F70","v":250},{"$f":"I70","v":250}]
[null,null,"kennis andere financiële producten","vrij in te vullen door de klant",null,null,null,null,null,null,null,null,null,null,{"$f":"100%-SUM(O14:O17)","v":0.5}]
[null,null,"beleggingen in andere financiële producten","vrij in te vullen door de klant"]
["B. Financiële situatie","4 roerend vermogen","a","< €12,500","het meest doorslag-gevend",{"$f":"VLOOKUP(E20,$L$2:$M$6,2)","v":150},{"$f":"'scoring vragenlijst'!G28","v":0},{"$f":"RANDBETWEEN(1,5)","v":1},{"$f":"IF(H20=1,G20,IF(H20=2, G21,IF(H20=3,G22,IF(H20=4,G23,G24))))","v":0},{"$f":"G20/$F$52","v":0}]
{"$rows_left_out":59}
{"sheet":"scoring vragenlijst","index":1,"n_rows":88,"n_cols":14,"rows_kept":88,"cut":false,"hidden":true,"merged":[[71,5,74,5],[75,5,78,5],[79,5,82,5],[83,5,86,5],[83,4,86,4],[72,1,74,1],[76,1,78,1],[27,0,49,0],[71,4,74,4],[71,0,86,0],[79,4,82,4],[70,2,70,3],[80,1,82,1],[75,4,78,4],[84,1,86,1],[1,0,26,0],[50,0,58,0],[50,1,54,1],[55,4,58,4],[50,4,54,4],[47,1,49,1],[9,2,16,2],[17,2,24,2],[9,1,26,1],[47,4,49,4],[1,4,2,4],[9,4,24,4],[1,5,2,5],[5,5,8,5],[9,5,24,5],[3,5,4,5],[0,2,0,3],[43,4,46,4],[1,1,2,1],[3,1,4,1],[3,4,4,4],[39,1,42,1],[27,4,31,4],[27,1,31,1],[5,4,8,4],[35,1,38,1],[32,1,34,1],[32,4,34,4],[43,1,46,1],[35,4,38,4],[65,8,65,13],[66,8,66,13],[67,8,67,13],[27,5,31,5],[43,5,46,5],[47,5,49,5],[32,5,34,5],[64,8,64,13],[63,8,63,13],[35,5,38,5],[55,5,58,5],[50,5,54,5]]}
[null,"vragen","antwoordmogelijkheden",null,"algemene weging","scoring/vraag","scoring/ antwoord","max score","min score","gewicht indiv antwoord tov totale score (meest doorslaggevende indiv antwoord aangegeven in rood)",null,null,"soort vraag","gewicht"]
["A. Kennis en ervaring","1 kennis uit opleiding","a","nee","minst doorslag-gevend",{"$f":"VLOOKUP(E2,$M$2:$N$6,2)","v":35},0,null,null,{"$f":"G2/$F$60","v":0},null,null,"het meest doorslaggevend",150]
[null,null,"b","ja",null,null,{"$f":"F2","v":35},{"$f":"MAX(G2:G3)","v":35},null,3.5000000000000003E-2,null,null,"meer doorslaggevend",125]
[null,"2 beroeps-matige kennis","a","nee","minst doorslag-gevend",{"$f":"VLOOKUP(E2,$M$2:$N$6,2)","v":35},0,null,{"$f":"MIN(G2:G5)","v":0},0,null,null,"midden",100]
[null,null,"b","ja",null,null,{"$f":"F4","v":35},{"$f":"MAX(G4:G5)","v":35},null,3.5000000000000003E-2,null,null,"minder",60]
[null,"2 interesse","a","geen interesse","midden",{"$f":"VLOOKUP(E6,$M$2:$N$6,2)","v":100},0,null,null,0,null,null,"minst doorslaggevend",35]
[null,null,"b","lees financiële bladzijden",null,null,30,null,null,0.03]
[null,null,"c","zoek actief financiële informatie",null,null,70,null,null,7.0000000000000007E-2,null,null,"totaal",{"$f":"F60","v":1000}]
[null,null,"d","volg financiële markt beroepsmatig",null,null,100,{"$f":"MAX(G6:G9)","v":100},{"$f":"MIN(G6:G9)","v":0},0.1]
[null,"3 tabel producten","producten die u kent","T21","minder",{"$f":"VLOOKUP(E10,$M$2:$N$6,2)","v":60},6,null,null,6.0000000000000001E-3]
[null,null,null,"T23 zonder kapitaalsbescherming",null,null,8,null,null,8.0000000000000002E-3]
[null,null,null,"T23 met kapitaalsbescherming",null,null,10,null,null,0.01]
[null,null,null,"onderliggende activa T23:"]
[null,null,null,"aandelen"]
[null,null,null,"obligaties en andere vastrentende producten"]
[null,null,null,"andere (te preciseren)"]
[null,null,null,"T26",null,null,6,null,null,6.0000000000000001E-3]
[null,null,"producten waarin occasioneel of regelmatig belegd","T21",null,null,6,null,null,6.0000000000000001E-3]
[null,null,null,"T23 zonder kapitaalsbescherming",null,null,8,null,null,8.0000000000000002E-3]
[null,null,null,"T23 met kapitaalsbescherming",null,null,10,null,null,0.01]
{"$rows_left_out":69}
{"sheet":"simulation","index":2,"n_rows":93,"n_cols":19,"rows_kept":93,"cut":false,"hidden":false,"merged":[[52,13,55,13],[56,13,58,13],[57,0,65,0],[57,1,61,1],[50,1,53,1],[50,4,53,4],[54,1,56,1],[54,8,56,8],[57,4,61,4],[57,5,61,5],[71,2,71,3],[54,4,56,4],[68,1,68,2],[50,5,53,5],[50,8,53,8],[57,8,61,8],[92,0,92,2],[73,1,75,1],[77,1,79,1],[81,1,83,1],[85,1,87,1],[90,1,90,2],[72,0,87,0],[10,5,11,5],[8,5,9,5],[84,4,87,4],[84,5,87,5],[84,8,87,8],[12,4,15,4],[80,8,83,8],[62,4,65,4],[62,5,65,5],[62,8,65,8],[76,5,79,5],[76,8,79,8],[12,5,15,5],[12,8,15,8],[34,8,38,8],[8,8,9,8],[10,8,11,8],[24,2,31,2],[34,0,56,0],[8,0,33,0],[16,5,31,5],[34,5,38,5],[16,8,31,8],[39,5,41,5],[54,5,56,5],[42,5,45,5],[42,8,45,8],[34,4,37,4],[39,8,41,8],[39,1,41,1],[46,1,49,1],[8,1,9,1],[72,4,75,4],[72,5,75,5],[72,8,75,8],[76,4,79,4],[80,4,83,4],[80,5,83,5],[34,1,37,1],[39,4,41,4],[42,1,45,1],[42,4,45,4],[0,1,3,1],[16,2,23,2],[7,2,7,3],[10,1,11,1],[8,4,9,4],[10,4,11,4],[16,4,31,4],[16,1,33,1]]}
[null,"identification du client",null,"nom"]
[null,null,null,"prénom"]
[null,null,null,"date de naissance"]
[null,null,null,"référence"]
[]
[null,"date"]
[]
[null,"questions","possibilités",null,"algemene weging","scoring/vraag","scoring/ antwoord","choix/réponse","score antwoord",null,"soort vraag","gewicht",null,"Check-up klant","resultaat klant",0.5,"maximum score","antwoord klant "]
["A. Connaissances et expérience","1 formation et connaissance","a","non","minst doorslag-gevend",{"$f":"VLOOKUP(E9,$K$9:$L$13,2)","v":35},{"$f":"'scoring vragenlijst'!G2","v":0},null,{"$f":"IF(H9=\"x\",G9,IF(H10=\"X\",G10,\"nog in te vullen\"))","v":"nog in te vullen"},null,"het meest doorslaggevend",{"$f":"'scoring vragenlijst'!N2","v":150},null,"Kennis en ervaring",{"$f":"R9/$Q$9","v":0},null,{"$f":"SUM(Q10:Q12)","v":170},{"$f":"SUM(R10:R12)","v":0}]
[null,null,"b","oui",null,null,{"$f":"'scoring vragenlijst'!G3","v":35},null,null,null,"meer doorslaggevend",{"$f":"'scoring vragenlijst'!N3","v":125},null,"1 kennis uit opleiding",{"$f":"R10/$Q$9","v":{"$error":"#VALUE!"}},0.5,{"$f":"F9","v":35},{"$f":"I9","v":"nog in te vullen"},"Tuyau"]
[null,"2 profession et connaissance","a","non","minst doorslag-gevend",{"$f":"VLOOKUP(E11,$K$9:$L$13,2)","v":35},{"$f":"'scoring vragenlijst'!G4","v":0},null,{"$f":"IF(H11=\"x\",G11,IF(H12=\"X\",G12,\"nog in te vullen\"))","v":"nog in te vullen"},null,"midden",{"$f":"'scoring vragenlijst'!N4","v":100},null,"2 beroepskennis",{"$f":"R11/$Q$9","v":{"$error":"#VALUE!"}},0.5,{"$f":"F11","v":35},{"$f":"I11","v":"nog in te vullen"},"Utilisez le bouton                         pour naviguer entre les zones de réponse."]
[null,null,"b","oui",null,null,{"$f":"'scoring vragenlijst'!G5","v":35},null,null,null,"minder",{"$f":"'scoring vragenlijst'!N5","v":60},null,"3 interesse",{"$f":"R12/$Q$9","v":{"$error":"#VALUE!"}},0.5,{"$f":"F13","v":100},{"$f":"I13","v":"nog in te vullen"}]
[null,"3 intérêt","a","pas intéressé","midden",{"$f":"VLOOKUP(E13,$K$9:$L$13,2)","v":100},{"$f":"'scoring vragenlijst'!G6","v":0},null,{"$f":"IF(H13=\"x\",G13,IF(H14=\"x\",G14,IF(H15=\"x\",G15,IF(H16=\"x\",G16,\"nog in te vullen\"))))","v":"nog in te vullen"},null,"minst doorslaggevend",{"$f":"'scoring vragenlijst'!N6","v":35},null,null,{"$f":"100%-SUM(O10:O12)","v":{"$error":"#VALUE!"}}]
[null,null,"b","lire les pages financières",null,null,{"$f":"'scoring vragenlijst'!G7","v":30},null,null,null,null,null,null,"Financiële situatie",{"$f":"R14/$Q$14","v":0},null,{"$f":"SUM(Q15:Q18)","v":420},{"$f":"SUM(R15:R18)","v":0}]
[null,null,"c","recherche des informations financières",null,null,{"$f":"'scoring vragenlijst'!G8","v":70},null,null,null,"totaal",{"$f":"F67","v":1000},null,"4 roerend vermogen",{"$f":"R15/$Q$14","v":{"$error":"#VALUE!"}},0.5,{"$f":"F35","v":150},{"$f":"I35","v":"nog in te vullen"}]
[null,null,"d","suivre les marchés fianciers dans les activités professionnelles",null,null,{"$f":"'scoring vragenlijst'!G9","v":100},null,null,null,null,null,null,"5 onroerend vermogen",{"$f":"R16/$Q$14","v":{"$error":"#VALUE!"}},0.5,{"$f":"F40","v":60},{"$f":"I40","v":"nog in te vullen"}]
[null,"3 table produits","les produits que vous connaissez","branche 21","minder",{"$f":"VLOOKUP(E17,$K$9:$L$13,2)","v":60},{"$f":"'scoring vragenlijst'!G10","v":6},null,{"$f":"(IF(H17=\"x\",G17,0)+(IF(H18=\"x\",G18,0))+(IF(H19=\"x\",G19,0))+(IF(H24=\"x\",G24,0))+(IF(H25=\"x\",G25,0))+(IF(H26=\"x\",G26,0))+(IF(H27=\"x\",G27,0))+(IF(H32=\"x\",G32,0)))","v":0},null,null,null,null,"6a netto-inkomen",{"$f":"R17/$Q$14","v":{"$error":"#VALUE!"}},0.5,{"$f":"F43","v":60},{"$f":"I43","v":"nog in te vullen"}]
[null,null,null,"branche 23 sans capital garanti",null,null,{"$f":"'scoring vragenlijst'!G11","v":8},null,null,null,null,null,null,"7 spaarmogelijkheid",{"$f":"R18/$Q$14","v":{"$error":"#VALUE!"}},0.5,{"$f":"F51","v":150},{"$f":"I51","v":"nog in te vullen"}]
[null,null,null,"branche 23 avec capital garanti",null,null,{"$f":"'scoring vragenlijst'!G12","v":10},null,null,null,null,null,null,null,{"$f":"100%-(SUM(O15:O18))","v":{"$error":"#VALUE!"}}]
[null,null,null,"les actifs sous-jacents branche 23:"]
{"$rows_left_out":74}
{"sheet":"analyse du client","index":3,"n_rows":109,"n_cols":19,"rows_kept":109,"cut":false,"hidden":false,"merged":[[5,4,5,8],[6,4,6,8],[7,4,7,8],[10,1,10,12],[15,1,15,12],[18,1,18,7],[25,1,25,12],[26,1,26,12],[16,1,16,7],[65,20,65,31],[41,1,41,12],[33,1,33,12],[27,1,27,12],[28,1,28,5],[29,9,29,10],[17,1,17,7],[32,1,32,5],[32,6,32,12],[34,1,35,5],[35,11,35,12],[36,11,36,12],[66,20,66,24],[66,26,66,29],[43,1,43,12],[38,1,39,5],[38,6,39,12],[57,1,57,12],[40,1,40,12],[104,1,104,12],[59,1,59,5],[76,1,76,12],[94,1,94,12],[81,1,81,12],[102,1,102,12],[60,1,60,12],[63,1,63,12],[78,1,78,12],[79,1,79,12],[103,1,103,12],[101,1,101,12],[37,6,37,8],[35,9,35,10],[77,8,77,12],[61,1,61,12],[73,1,73,12],[37,11,37,12],[56,1,56,12],[75,7,75,12],[74,1,74,5],[74,6,74,12],[30,9,30,10],[31,6,31,8],[29,6,29,8],[30,6,30,8],[36,6,36,8],[34,6,34,8],[35,6,35,8]]}
[]
[null,"< logotype intermédaire >"]
[]
[]
[]
[null,"nom intermédaire"]
[null,"adresse"]
[null,"code postal + commune"]
[null,null,null,null,null,null,null,null,null,null,null,"date",{"$f":"IF(simulation!H6=\"\",\"\",simulation!H6)","v":""}]
[null,null,null,null,null,null,null,null,null,null,null,"référence",{"$f":"IF(simulation!H4=\"\",\"\",simulation!H4)","v":""}]
[null,"Analyse du client"]
[null,"nom",null,null,{"$f":"IF(simulation!H1=\"\",\"\",simulation!H1)","v":""}]
[null,"prénom",null,null,{"$f":"IF(simulation!H2=\"\",\"\",simulation!H2)","v":""}]
[null,"date de naissance",null,null,{"$f":"IF(simulation!H3=\"\",\"\",simulation!H3)","v":""}]
[]
[null,"Vos connaissances et votre expérience ",null,null,null,null,null,null,null,null,null,null,null,null,null,null,null,"a. defensief","La sécurité est votre priorité ; vous attachez beaucoup d'importance à la protection du capital, même si c'est au détriment du rendement ; vous préférez d'une manière générale l'épargne et l'investissement avec peu de fluctuations et un rendement stable mais modeste."]
[null,null,null,null,null,null,null,null,null,null,null,null,null,null,null,null,null,"b. neutraal","Vous donnez la préférence à une croissance du capital sans être exposé à un risque trop élevé de baisse de valeur  ; vous êtes disposé à prendre quelques risques pour accroître le rendement, mais seulement dans une mesure limitée ; pour la majeure partie de vos avoirs, vous recherchez une épargne et un investissement avec peu de fluctuations et un rendement stable."]
[null,null,null,null,null,null,null,null,null,null,null,null,null,null,null,null,null,"c. evenwichtig","Rendement et limitation du risque sont deux critères importants ; vous trouvez acceptable de prendre un risque afin d'obtenir un rendement potentiellement plus élevé ; vous  n'êtes toutefois pas disposé à prendre des risques marqués qui pourraient entraîner une baisse de valeur considérable de votre épargne ou de votre investissement."]
[null,null,null,null,null,null,null,null,null,null,null,null,null,null,null,null,null,"d. dynamisch","Votre objectif est la croissance de votre capital à long terme ; vous estimez important d'avoir un rendement potentiel le plus élevé possible, tout en sachant que cela ne va pas sans risque ; vous acceptez de fortes variations à la hausse et à la baisse de la valeur des assurances d'épargne et d'investissement, consécutives par exemple à des fluctuations de cours ou de risques de change."]
[]
{"$rows_left_out":90}
{"sheet":"analyse klant obv rand. simul.","index":4,"n_rows":83,"n_cols":9,"rows_kept":83,"cut":false,"hidden":true,"merged":[[45,1,45,12],[50,1,50,12],[51,1,51,7],[52,1,52,7],[62,1,62,12],[51,8,51,12],[52,8,52,12],[46,7,46,12],[46,1,46,6],[24,8,24,12],[25,1,25,7],[25,8,25,12],[30,1,30,12],[27,1,27,12],[28,1,28,12],[20,1,20,12],[21,1,21,7],[21,8,21,12],[22,8,22,12],[23,8,23,12],[16,8,16,12],[17,8,17,12],[18,8,18,12],[19,1,19,7],[19,8,19,12],[6,1,6,7],[7,1,7,7],[14,1,14,12],[15,1,15,7],[15,8,15,12],[0,1,0,12],[2,1,2,3],[2,5,2,12],[4,1,4,12],[5,1,5,7],[81,1,81,12],[82,1,82,12],[47,1,47,12],[48,1,48,5],[48,7,48,10],[59,1,59,12]]}
[null,"Analyse van de klant"]
[]
[null,"klantenprofiel",null,null,null,{"$f":"'random simulaties'!F78","v":"b. neutre"}]
[]
[null,"Kennis en ervaring van de klant"]
[]
[]
[]
[]
[]
[]
[]
[]
[]
[null,"Productkennis"]
[null,{"$f":"IF(OR(simulation!$H$17=\"x\",simulation!$H$18=\"x\",simulation!$H$19=\"x\",simulation!$H$24=\"x\"),\"de klant kent volgende spaar- en beleggingsverzekeringen:\",\"de klant beschikt niet over kennis over spaar- en beleggingsverzekeringen\")","v":"de klant beschikt niet over kennis over spaar- en beleggingsverzekeringen"},null,null,null,null,null,null,{"$f":"IF('random simulaties'!$H$10=\"x\",\"tak 21-verzekeringen\",\"  \")","v":"  "}]
[null,null,null,null,null,null,null,null,{"$f":"IF('random simulaties'!$H$11=\"x\",\"tak 23-verzekeringen zonder kapitaalsbescherming\",\"  \")","v":"  "}]
[null,null,null,null,null,null,null,null,{"$f":"IF('random simulaties'!$H$12=\"x\",\"tak 23-verzekeringen met kapitaalsbescherming\",\"  \")","v":"  "}]
[null,null,null,null,null,null,null,null,{"$f":"IF('random simulaties'!$H$13=\"x\",\"tak 26-kapitalisatieverrichtingen\",\"  \")","v":"  "}]
[null,"de klant kent volgende andere financiële producten:",null,null,null,null,null,null,{"$f":"IF('random simulaties'!H18=\"nog in te vullen\",\" \",'random simulaties'!H18)","v":0}]
{"$rows_left_out":64}
{"sheet":"analyse klant obv rand. sim (2","index":5,"n_rows":94,"n_cols":19,"rows_kept":94,"cut":false,"hidden":true,"merged":[[15,1,15,12],[13,1,13,12],[14,1,14,12],[25,8,25,12],[16,1,16,7],[16,8,16,12],[17,8,17,12],[18,8,18,12],[19,8,19,12],[21,1,21,12],[22,1,22,7],[22,8,22,12],[23,8,23,12],[20,1,20,7],[20,8,20,12],[24,8,24,12],[0,1,0,12],[2,1,2,12],[3,1,3,7],[4,1,4,7],[5,1,5,7],[45,6,45,9],[26,1,26,7],[26,8,26,12],[28,1,28,12],[29,1,29,12],[31,1,31,12],[43,1,43,12],[44,1,44,6],[44,7,44,12],[42,1,42,12],[93,1,93,12],[45,1,45,5],[49,1,49,12],[89,1,91,12],[61,7,61,12],[62,1,62,6],[62,7,62,12],[60,1,60,12],[46,1,46,12],[47,1,47,12],[63,1,63,12],[68,1,68,12],[92,1,92,12],[65,1,65,12],[66,1,66,12],[61,1,61,6]]}
[null,"Analyse van de klant"]
[]
[null,"Uw kennis en ervaring ",null,null,null,null,null,null,null,null,null,null,null,null,null,null,null,"a. defensief","Veiligheid is uw prioriteit; U hecht veel belang aan kapitaalbescherming, zelfs als dit ten koste gaat van rendement; U heeft algemeen de voorkeur voor sparen en beleggen met weinig schommelingen en een stabiel maar bescheiden rendement."]
[null,null,null,null,null,null,null,null,null,null,null,null,null,null,null,null,null,"b. neutraal","U geeft de voorkeur aan aangroei van het vermogen zonder daarbij blootgesteld te worden aan een al te hoog risico op waardedaling; U bent bereid  enig risico te nemen om het rendement te verhogen, maar slechts in beperkte mate; Voor het grootste deel van uw vermogen streeft u naar sparen en beleggen met weinig schommelingen en een stabiel rendement."]
[null,null,null,null,null,null,null,null,null,null,null,null,null,null,null,null,null,"c. evenwichtig","Rendement en beperking van het risico zijn allebij belangrijk; U vindt het aanvaardbaar om risico te nemen om een potentieel hoger rendement te behalen; U heeft evenwel geen bereidheid om uitgesproken risico’s te nemen waardoor uw spaartegoed of belegging sterk in waarde zou kunnen dalen."]
[null,null,null,null,null,null,null,null,null,null,null,null,null,null,null,null,null,"d. dynamisch","Uw doelstelling is de groei van uw vermogen op lange termijn; U vindt een zo hoog mogelijk potentieel rendement belangrijk, wetende dat daaraan risico's verbonden zijn; U aanvaardt sterke opwaartse en neerwaartse schommelingen in de waarde van de spaar- en beleggingsverzekeringen, bijvoorbeeld ten gevolge van koersschommelingen of wisselrisico’s.  "]
[]
[]
[]
[]
[]
[]
[]
[null,"Algemene financiële kennis"]
[null,{"$f":"IF('random simulaties'!O2<0.33,\"U heeft weinig algemene financiële kennis.\",IF('random simulaties'!O2<0.66,\"U heeft een matige algemene financiële kennis.\",\"U heeft een grote algemene financiële kennis.\"))","v":"U heeft een matige algemene financiële kennis."}]
[null,"Productkennis"]
[null,{"$f":"IF(OR(simulation!$H$17=\"x\",simulation!$H$18=\"x\",simulation!$H$19=\"x\",simulation!$H$24=\"x\"),\"U kent volgende spaar- en beleggingsverzekeringen:\",\"U beschikt niet over kennis over spaar- en beleggingsverzekeringen\")","v":"U beschikt niet over kennis over spaar- en beleggingsverzekeringen"},null,null,null,null,null,null,{"$f":"IF('random simulaties'!$H$10=\"x\",\"tak 21-verzekeringen\",\"  \")","v":"  "}]
[null,null,null,null,null,null,null,null,{"$f":"IF('random simulaties'!$H$11=\"x\",\"tak 23-verzekeringen zonder kapitaalsbescherming\",\"  \")","v":"  "}]
[null,null,null,null,null,null,null,null,{"$f":"IF('random simulaties'!$H$12=\"x\",\"tak 23-verzekeringen met kapitaalsbescherming\",\"  \")","v":"  "}]
[null,null,null,null,null,null,null,null,{"$f":"IF('random simulaties'!$H$13=\"x\",\"tak 26-kapitalisatieverrichtingen\",\"  \")","v":"  "}]
{"$rows_left_out":75}
{"sheet":"invoerresultaten","index":6,"n_rows":1,"n_cols":1,"rows_kept":1,"cut":false,"hidden":true,"merged":[]}
["x"]